Target
HTH-type transcriptional regulator EthR
Ligand
BDBM228833
Substrate
Meas. Tech.
Isothermal Titration Calorimetry (ITC)
Kd
2.0e+4±n/a nM
Citation
 Nikiforov, POBlaszczyk, MSurade, SBoshoff, HISajid, ADelorme, VDeboosere, NBrodin, PBaulard, ARBarry, CEBlundell, TLAbell, C Fragment-Sized EthR Inhibitors Exhibit Exceptionally Strong Ethionamide Boosting Effect in Whole-Cell Mycobacterium tuberculosis Assays. ACS Chem Biol 12:1390-1396 (2017)  
Target
Name:
HTH-type transcriptional regulator EthR
Synonyms:
ETHR_MYCTU Transcriptional repressor EthR (EthR) ethR
Type:
Protein
Mol. Mass.:
23751.94
Organism:
Mycobacterium tuberculosis
Description:
P9WMC1
Residue:
216
  
Inhibitor
Name:
BDBM228833
Synonyms:
(E)-3-(Furan-3-yl)-1-(pyrrolidin-1-yl)prop-2-en-1-one (7)
Type:
Small organic molecule
Emp. Form.:
C11H13NO2
Mol. Mass.:
191.2264
SMILES:
O=C(\C=C\c1ccoc1)N1CCCC1
: