Target
Neuromedin-K receptor
Ligand
BDBM233257
Substrate
Meas. Tech.
[3H]SR142801 Competition Binding Assay
pH
7.4±n/a
Temperature
277.15±n/a K
Ki
0.8±n/a nM
Comments
extracted
Citation
 Knust, HKoblet, ANettekoven, MRatni, HRiemer, CVifian, W Pyrrolidine compounds US Patent  US9346786 Publication Date 5/24/2016 
Target
Name:
Neuromedin-K receptor
Synonyms:
NK-3 receptor NK3R NKR Neurokinin B receptor Neuromedin-3 receptor (NK-3R) Neuromedin-K receptor Neuromedin-K receptor (NK3) TAC3R Tachykinin receptor 3 | Tachykinin receptor 3 (NK3)
Type:
Enzyme
Mol. Mass.:
52221.96
Organism:
Homo sapiens (Human)
Description:
P29371
Residue:
465
  
Inhibitor
Name:
BDBM233257
Synonyms:
US9346786, 61
Type:
Small organic molecule
Emp. Form.:
C30H29ClF2N6O3
Mol. Mass.:
595.039
SMILES:
CCN([C@@H]1CN(C[C@H]1c1ccc(Cl)c(F)c1)C(=O)C1CCN(CC1)c1cnc(cn1)C#N)C(=O)Oc1ccc(F)cc1
: