Target
Carbonic anhydrase 7
Ligand
BDBM10880
Substrate
Meas. Tech.
CA Activity Assay
pH
7.5±n/a
Ki
2.5±0.0 nM
Comments
0 mM acetaldehyde extracted
Citation
 Bootorabi, FJänis, JHytönen, VPValjakka, JKuuslahti, MVullo, DNiemelä, OSupuran, CTParkkila, S Acetaldehyde-derived modifications on cytosolic human carbonic anhydrases. J Enzyme Inhib Med Chem 26:862-70 (2011)  
Target
Name:
Carbonic anhydrase 7
Synonyms:
CA-VII CAH7_HUMAN Carbonic anhydrase Carbonic anhydrase VII (CA VII)
Type:
Enzyme
Mol. Mass.:
29664.11
Organism:
Homo sapiens (Human)
Description:
Human cloned isozyme.
Residue:
264
  
Inhibitor
Name:
BDBM10880
Synonyms:
AZA AZM acetazolamide Acetazolamide Acetazolamide (AZA) Acetazolamide, 5 Acetazolamide, AZA CHEMBL20 Sulfonamide, 1 US11278534, Example acetazolamide sulfonamide 1
Type:
Small organic molecule
Emp. Form.:
C4H6N4O3S2
Mol. Mass.:
222.245
SMILES:
CC(=O)Nc1nnc(s1)S(N)(=O)=O
: