Target
N(G),N(G)-dimethylarginine dimethylaminohydrolase 1
Ligand
BDBM235692
Substrate
Meas. Tech.
In Vitro hDDAH-1 Assay
pH
7.4±0
Temperature
310.15±0 K
Ki
1.968e+6± 2.90e+5 nM
Citation
 Kotthaus, JSchade, DKotthaus, JClement, B Designing modulators of dimethylarginine dimethylaminohydrolase (DDAH): a focus on selectivity over arginase. J Enzyme Inhib Med Chem 27:24-8 (2012)  
Target
Name:
N(G),N(G)-dimethylarginine dimethylaminohydrolase 1
Synonyms:
DDAH DDAH1_HUMAN Dimethylarginine dimethylaminohydrolase 1 (DDAH) Dimethylarginine dimethylaminohydrolase 1 (DDAH) L271G Dimethylarginine dimethylaminohydrolase 1 (DDAH1) | N(G),N(G)-dimethylarginine dimethylaminohydrolase 1
Type:
Protein
Mol. Mass.:
31116.90
Organism:
Homo sapiens (Human)
Description:
O94760
Residue:
285
  
Inhibitor
Name:
BDBM235692
Synonyms:
hDDAH inhibitor, 2g
Type:
Small organic molecule
Emp. Form.:
C6H13N5O4
Mol. Mass.:
219.1985
SMILES:
N[C@@H](CCCNC(=N)N[N+]([O-])=O)C(O)=O
: