Target
Induced myeloid leukemia cell differentiation protein Mcl-1 homolog
Ligand
BDBM238182
Substrate
Meas. Tech.
Fluorescence Polarization-Based Binding Assay
pH
7.4±n/a
Temperature
298.15±n/a K
Ki
1400±40 nM
IC50
7300±200 nM
Comments
extracted
Citation
 Nikolovska-Coleska, ZAbulwerdi, FShowalter, HMiao, LStuckey, JMady, A Small molecule inhibitors of MCL-1 and uses thereof US Patent  US9394303 Publication Date 7/19/2016 
Target
Name:
Induced myeloid leukemia cell differentiation protein Mcl-1 homolog
Synonyms:
Bcl-2-related protein EAT/mcl1 Mcl-1 | Mcl1
Type:
Developmental protein
Mol. Mass.:
35215.08
Organism:
Mus musculus (Mouse)
Description:
Residue:
331
  
Inhibitor
Name:
BDBM238182
Synonyms:
US9394303, 9
Type:
Small organic molecule
Emp. Form.:
C25H19N3O4
Mol. Mass.:
425.4361
SMILES:
Cc1nn(Cc2cccc(Oc3ccccc3)c2)c2nc(cc(C(O)=O)c12)-c1ccco1
: