Target
Prostaglandin E2 receptor EP2 subtype
Ligand
BDBM240747
Substrate
Meas. Tech.
Cell Based Assay
pH
7.4±n/a
Temperature
310.15±n/a K
EC50
2500±n/a nM
Comments
extracted
Citation
 Martos, JLCarling, WRWoodward, DFWang, JWKangasmetsa, JJ Compounds act at multiple prostaglandin receptors giving a general anti-inflammatory response US Patent  US9422273 Publication Date 8/23/2016 
Target
Name:
Prostaglandin E2 receptor EP2 subtype
Synonyms:
PE2R2_HUMAN PTGER2 Prostaglandin E2 receptor Prostanoid EP2 Receptor
Type:
Enzyme
Mol. Mass.:
39775.71
Organism:
Homo sapiens (Human)
Description:
P43116
Residue:
358
  
Inhibitor
Name:
BDBM240747
Synonyms:
US9422273, 12e
Type:
Small organic molecule
Emp. Form.:
C27H36F4N4O5S
Mol. Mass.:
604.657
SMILES:
CCCCCCCCNC(=O)c1coc(n1)[C@@H]1CCCN1Cc1cc(F)ccc1CCC(=O)NS(=O)(=O)C(F)(F)F
: