Target
Substance-P receptor
Ligand
BDBM242749
Substrate
Meas. Tech.
Binding Assay
pH
7.4±n/a
Temperature
298.15±n/a K
Ki
>30000±n/a nM
Comments
extracted
Citation
 Hoveyda, HDutheuil, GFraser, G Substituted [1,2,4]triazolo[4,3-a]pyrazines as selective NK-3 receptor antagonists US Patent  US9422299 Publication Date 8/23/2016 
Target
Name:
Substance-P receptor
Synonyms:
NK-1 receptor NK1 Receptor NK1R_HUMAN Neurokinin-1 (NK-1) SPR TACR1 Tachykinin receptor 1 (NK1) | tachykinin
Type:
G Protein-Coupled Receptor (GPCR)
Mol. Mass.:
46254.43
Organism:
Homo sapiens (Human)
Description:
P25103
Residue:
407
  
Inhibitor
Name:
BDBM242749
Synonyms:
US10030025, Compound 13 US11731974, Compound 13 US9987274, Compound 13
Type:
Small organic molecule
Emp. Form.:
C17H17FN6O2
Mol. Mass.:
356.3543
SMILES:
CCc1noc(n1)-c1nnc2[C@@H](C)N(CCn12)C(=O)c1ccc(F)cc1
: