Target
Muscarinic acetylcholine receptor M3
Ligand
BDBM228865
Substrate
Meas. Tech.
[3H]-NMS Binding Assay
Temperature
298.15±n/a K
IC50
3.00±n/a nM
Comments
extracted
Citation
 Fernandez Forner, MDPrat Quinones, MBuil Albero, MA Quinuclidine derivatives and medicinal compositions containing the same US Patent  US9687478 Publication Date 6/27/2017 
Target
Name:
Muscarinic acetylcholine receptor M3
Synonyms:
ACM3_HUMAN Cholinergic, muscarinic M3 Muscarinic receptor M3 | RecName: Full=Muscarinic acetylcholine receptor M3
Type:
Enzyme
Mol. Mass.:
66151.03
Organism:
Homo sapiens (Human)
Description:
P20309
Residue:
590
  
Inhibitor
Name:
BDBM228865
Synonyms:
Ipratropium | US9333195, IPRATROPIUM
Type:
Small Organic Molecule
Emp. Form.:
C20H30NO3
Mol. Mass.:
332.4566
SMILES:
CC(C)[N+]1(C)[C@H]2CC[C@@H]1CC(C2)OC(=O)C(CO)c1ccccc1
: