Target
Carbonic anhydrase 1
Ligand
BDBM50163863
Substrate
Meas. Tech.
Thermal Shift Assay (TSA)
pH
7±n/a
Kd
12±n/a nM
Comments
extracted
Citation
 Zubriene, ACapkauskaite, EGylyte, JKi?onaite, MTumkevicius, SMatulis, D Benzenesulfonamides with benzimidazole moieties as inhibitors of carbonic anhydrases I, II, VII, XII and XIII. J Enzyme Inhib Med Chem 29:124-31 (2014)  
Target
Name:
Carbonic anhydrase 1
Synonyms:
CA-I CAB Carbonate dehydratase I Carbonic anhydrase 1 (CA I) Carbonic anhydrase 1 (Recombinant CA I) Carbonic anhydrase B Carbonic anhydrase I (CA I) Carbonic anhydrase I (CAI) Carbonic anhydrase isoenzyme I (hCA I) | hCA
Type:
Enzyme
Mol. Mass.:
28873.37
Organism:
Homo sapiens (Human)
Description:
P00915
Residue:
261
  
Inhibitor
Name:
BDBM50163863
Synonyms:
4-(1H-benzimidazol-1-ylacetyl)-2-chlorobenzenesulfonamide (2a) carbonic anhydrase (CA) inhibitors, benzenesulphonamide ligand, 2
Type:
Small organic molecule
Emp. Form.:
C15H12ClN3O3S
Mol. Mass.:
349.792
SMILES:
NS(=O)(=O)c1ccc(cc1Cl)C(=O)Cn1cnc2ccccc12
: