Target
Carbonic anhydrase 2
Ligand
BDBM50163864
Substrate
Meas. Tech.
Thermal Shift Assay (TSA)
pH
7±n/a
Kd
4340±n/a nM
Comments
extracted
Citation
 Zubriene, ACapkauskaite, EGylyte, JKi?onaite, MTumkevicius, SMatulis, D Benzenesulfonamides with benzimidazole moieties as inhibitors of carbonic anhydrases I, II, VII, XII and XIII. J Enzyme Inhib Med Chem 29:124-31 (2014)  
Target
Name:
Carbonic anhydrase 2
Synonyms:
CA-II CAC Carbonate dehydratase II Carbonic anhydrase 2 (CA-II) Carbonic anhydrase C Carbonic anhydrase II (CA-II) Carbonic anhydrase II (hCA II) | Carbonic anhydrase isoenzyme II (hCA II)
Type:
Enzyme
Mol. Mass.:
29250.71
Organism:
Homo sapiens (Human)
Description:
P00918
Residue:
260
  
Inhibitor
Name:
BDBM50163864
Synonyms:
3-(1H-benzimidazol-1-ylacetyl)benzenesulfonamide (3a) carbonic anhydrase (CA) inhibitors, benzenesulphonamide ligand, 3
Type:
Small organic molecule
Emp. Form.:
C15H13N3O3S
Mol. Mass.:
315.347
SMILES:
NS(=O)(=O)c1cccc(c1)C(=O)Cn1cnc2ccccc12
: