Target
Carbonic anhydrase 12
Ligand
BDBM50163864
Substrate
Meas. Tech.
Thermal Shift Assay (TSA)
pH
7±n/a
Kd
12500±n/a nM
Comments
extracted
Citation
 Zubriene, ACapkauskaite, EGylyte, JKi?onaite, MTumkevicius, SMatulis, D Benzenesulfonamides with benzimidazole moieties as inhibitors of carbonic anhydrases I, II, VII, XII and XIII. J Enzyme Inhib Med Chem 29:124-31 (2014)  
Target
Name:
Carbonic anhydrase 12
Synonyms:
CA-XII CAH12_HUMAN Carbonic anhydrase Carbonic anhydrase XII Carbonic anhydrase XII (CAXII) | Tumor antigen HOM-RCC-3.1.3
Type:
Enzyme
Mol. Mass.:
39456.00
Organism:
Homo sapiens (Human)
Description:
Catalytic domain of human cloned isozyme was used in the assay
Residue:
354
  
Inhibitor
Name:
BDBM50163864
Synonyms:
3-(1H-benzimidazol-1-ylacetyl)benzenesulfonamide (3a) carbonic anhydrase (CA) inhibitors, benzenesulphonamide ligand, 3
Type:
Small organic molecule
Emp. Form.:
C15H13N3O3S
Mol. Mass.:
315.347
SMILES:
NS(=O)(=O)c1cccc(c1)C(=O)Cn1cnc2ccccc12
: