Target
Triosephosphate isomerase
Ligand
BDBM246597
Substrate
Meas. Tech.
Inhibition Assay
pH
7.4±0
Temperature
310.15±0 K
IC50
>1.00e+5±n/a nM
Citation
 Alvarez, GMartínez, JAguirre-López, BCabrera, NPérez-Díaz, Lde Gómez-Puyou, MTGómez-Puyou, APérez-Montfort, RGarat, BMerlino, AGonzález, MCerecetto, H New chemotypes as Trypanosoma cruzi triosephosphate isomerase inhibitors: a deeper insight into the mechanism of inhibition. J Enzyme Inhib Med Chem 29:198-204 (2014)  
Target
Name:
Triosephosphate isomerase
Synonyms:
TIM TPI1 Triose-phosphate isomerase Triosephosphate isomerase (TIM)
Type:
Enzyme
Mol. Mass.:
30788.11
Organism:
Homo sapiens (Human)
Description:
P60174
Residue:
286
  
Inhibitor
Name:
BDBM246597
Synonyms:
TIM inhibitor, 2
Type:
Small organic molecule
Emp. Form.:
C12H6Cl2N2O
Mol. Mass.:
265.095
SMILES:
Oc1ccc2nc3cc(Cl)c(Cl)cc3nc2c1
: