Target
Transient receptor potential M8 protein
Ligand
BDBM248370
Substrate
Meas. Tech.
Functional Assay
Temperature
310.15±n/a K
IC50
0.6±n/a nM
Comments
extracted
Citation
 Branum, STColburn, RWDax, SLFlores, CMJetter, MCLiu, YLudovici, DMacielag, MJMatthews, JMMcNally, JJAndraka, LMRussell, RKQin, NTeleha, CWells, KMYouells, SCYoungman, MA Sulfonamides as TRPM8 modulators US Patent  US9434711 Publication Date 9/6/2016 
Target
Name:
Transient receptor potential M8 protein
Synonyms:
Cold-menthol receptor (TRPM8) Transient receptor potential M8 protein Transient receptor potential melastatin subfamily, type 8 (TRPM8)
Type:
Enzyme
Mol. Mass.:
127589.43
Organism:
Canis lupus familiaris (Dog)
Description:
Q1A7N1
Residue:
1104
  
Inhibitor
Name:
BDBM248370
Synonyms:
US9434711, 227
Type:
Small organic molecule
Emp. Form.:
C21H21F4NO3S2
Mol. Mass.:
475.52
SMILES:
CCS(=O)(=O)N(Cc1ccc(F)c(c1)C(F)(F)F)c1sc2ccccc2c1C(C)(C)O
: