Target
Fibroblast growth factor receptor 3
Ligand
BDBM249396
Substrate
FGFR1 substrate peptide
Meas. Tech.
Kinase HotSpot Assay
pH
7.5±n/a
Temperature
298.15±n/a K
IC50
2000±n/a nM
Comments
extracted
Citation
 Reynolds, DHao, MWang, JPrajapati, SSatoh, TSelvaraj, A Pyrimidine FGFR4 inhibitors US Patent  US9434697 Publication Date 9/6/2016 
Target
Name:
Fibroblast growth factor receptor 3
Synonyms:
CD_antigen: CD333 FGFR3 Fibroblast growth factor receptor JTK4
Type:
Protein
Mol. Mass.:
87699.57
Organism:
Homo sapiens (Human)
Description:
P22607
Residue:
806
  
Inhibitor
Name:
BDBM249396
Synonyms:
US10537571, Compound 108 US10654836, The compound of example 108 of WO2015057938 US11001572, Example 108 of WO2015057938 US9730931, Compound 108
Type:
Small organic molecule
Emp. Form.:
C29H34Cl2N8O4
Mol. Mass.:
629.537
SMILES:
CCN1CCN(CC1)c1ccc(Nc2cc(ncn2)N(C)C(=O)Nc2c(Cl)c(OC)cc(OC)c2Cl)c(NC(=O)C=C)c1
:
Substrate
Name:
FGFR1 substrate peptide
Synonyms:
Type:
Protein
Mol. Mass.:
1596.80
Organism:
Artificial Organism
Description:
SEQ ID NO:1
Residue:
14
KKKSPGEYVNIEFG