Target
Prokineticin receptor 1
Ligand
BDBM250574
Substrate
Meas. Tech.
Biological Assay
pH
7.4±n/a
Temperature
310.15±n/a K
IC50
900±n/a nM
Comments
extracted
Citation
 Carroll, CGoldby, ATeall, M Sulfonyl piperidine derivatives and their use for treating prokineticin mediated diseases US Patent  US9475795 Publication Date 10/25/2016 
Target
Name:
Prokineticin receptor 1
Synonyms:
G-protein coupled receptor 73 GPR73 PK-R1 PKR1_HUMAN | PROKR1
Type:
enzyme
Mol. Mass.:
44779.92
Organism:
Homo sapiens (Human)
Description:
Q8TCW9
Residue:
393
  
Inhibitor
Name:
BDBM250574
Synonyms:
US10167273, Example 53 US11512066, Example 53 | US9475795, 53
Type:
Small organic molecule
Emp. Form.:
C18H25ClN4O2S
Mol. Mass.:
396.935
SMILES:
CN(C1CCN(CC1)S(=O)(=O)c1c(C)nn(C)c1C)c1ccc(Cl)cc1
: