Target
Carbonic anhydrase 2
Ligand
BDBM50278319
Substrate
Meas. Tech.
ChEMBL_158305 (CHEMBL763190)
pH
7.5±n/a
Temperature
293.15±n/a K
Ki
84000±n/a nM
Citation
 Del Prete, SVullo, DDe Luca, VCarginale, Vdi Fonzo, POsman, SMAlOthman, ZSupuran, CTCapasso, C Anion inhibition profiles of a-, ß- and ¿-carbonic anhydrases from the pathogenic bacterium Vibrio cholerae. Bioorg Med Chem 24:3413-7 (2016)  
Target
Name:
Carbonic anhydrase 2
Synonyms:
CA-II CAC Carbonate dehydratase II Carbonic anhydrase 2 (CA-II) Carbonic anhydrase C Carbonic anhydrase II (CA-II) Carbonic anhydrase II (hCA II) | Carbonic anhydrase isoenzyme II (hCA II)
Type:
Enzyme
Mol. Mass.:
29250.71
Organism:
Homo sapiens (Human)
Description:
P00918
Residue:
260
  
Inhibitor
Name:
BDBM50278319
Synonyms:
CHEMBL502764 | sodium persulfate
Type:
Small organic molecule
Emp. Form.:
O8S2
Mol. Mass.:
192.126
SMILES:
[O-]S(=O)(=O)OOS([O-])(=O)=O
: