Target
Carbonic anhydrase
Ligand
BDBM26996
Substrate
Meas. Tech.
ChEMBL_158311 (CHEMBL763368)
pH
7.5±n/a
Temperature
293.15±n/a K
Ki
85000±n/a nM
Citation
 Del Prete, SVullo, DDe Luca, VCarginale, Vdi Fonzo, POsman, SMAlOthman, ZSupuran, CTCapasso, C Anion inhibition profiles of a-, ß- and ¿-carbonic anhydrases from the pathogenic bacterium Vibrio cholerae. Bioorg Med Chem 24:3413-7 (2016)  
Target
Name:
Carbonic anhydrase
Synonyms:
Beta-carbonic anhydrase | VchβCA
Type:
Protein
Mol. Mass.:
25222.79
Organism:
Vibrio cholerae
Description:
A0A086SLX8
Residue:
222
  
Inhibitor
Name:
BDBM26996
Synonyms:
CHEMBL21485 Phenyl-boronic acid benzeneboronic acid phenylboronic acid
Type:
Emp. Form.:
C6H7BO2
Mol. Mass.:
121.93
SMILES:
OB(O)c1ccccc1
: