Target
Dual specificity protein kinase TTK
Ligand
BDBM251789
Substrate
Meas. Tech.
Kinase Assay
pH
7.7±n/a
Temperature
295.15±n/a K
IC50
151.0±n/a nM
Comments
extracted
Citation
 Klar, UKoppitz, MKosemund, DBohlmann, RBader, BLienau, PSiemeister, GPrechtl, SNguyen, DScott, W Imidazopyrazines US Patent  US9468642 Publication Date 10/18/2016 
Target
Name:
Dual specificity protein kinase TTK
Synonyms:
Dual specificity protein kinase (TTK) MPS1 Monopolar Spindle 1 (MPS1) Monopolar Spindle 1 Kinase (MPS1) TTK | TTK_HUMAN
Type:
Protein
Mol. Mass.:
97086.79
Organism:
Homo sapiens (Human)
Description:
P33981
Residue:
857
  
Inhibitor
Name:
BDBM251789
Synonyms:
US9468642, 32
Type:
Small organic molecule
Emp. Form.:
C22H19N5OS
Mol. Mass.:
401.484
SMILES:
CSc1nc(cn2c(cnc12)-c1ccc(cc1)-c1cnc([nH]1)C1CC1)C#CCO
: