Target
Cyclin-dependent kinase 4/G1/S-specific cyclin-D1 [L188C]
Ligand
BDBM6643
Substrate
G1 peptide
Meas. Tech.
CDKs Assay
pH
7.4±n/a
Temperature
303.15±n/a K
IC50
36000±n/a nM
Citation
 Honma, THayashi, KAoyama, THashimoto, NMachida, TFukasawa, KIwama, TIkeura, CIkuta, MSuzuki-Takahashi, IIwasawa, YHayama, TNishimura, SMorishima, H Structure-based generation of a new class of potent Cdk4 inhibitors: new de novo design strategy and library design. J Med Chem 44:4615-27 (2001)  
Target
Name:
Cyclin-dependent kinase 4/G1/S-specific cyclin-D1 [L188C]
Synonyms:
CDK4/Cyclin D | Cyclin-Dependent Kinase 4 (CDK4)
Type:
Protein Complex
Mol. Mass.:
Description:
CDK4/D complexes were purified from insect cells co-infected with baculovirus vectors containing each of the components.
Components:
This complex has 2 components.
Component 1
Name:
Cyclin-dependent kinase 4
Synonyms:
CDK4 Cell division protein kinase 4 PSK-J3
Type:
Enzyme Subunit
Mol. Mass.:
33731.96
Organism:
Homo sapiens (Human)
Description:
P11802
Residue:
303
  
Component 2
Name:
G1/S-specific cyclin-D1 [L188C]
Synonyms:
BCL1 CCND1_HUMAN PRAD1
Type:
Enzyme Subunit
Mol. Mass.:
33634.57
Organism:
Homo sapiens (Human)
Description:
P24385[L188C]
Residue:
295
  
Inhibitor
Name:
BDBM6643
Synonyms:
2-amino-4-(2H-1,3-benzodioxol-5-yl)-6-methoxypyridine-3,5-dicarbonitrile | 4-Aryl-2-aminopyridine deriv. 10
Type:
Small organic molecule
Emp. Form.:
C15H10N4O3
Mol. Mass.:
294.2649
SMILES:
COc1nc(N)c(C#N)c(-c2ccc3OCOc3c2)c1C#N
:
Substrate
Name:
G1 peptide
Synonyms:
Type:
Peptide
Mol. Mass.:
1483.28
Organism:
Description:
Residue:
13
RPPTLSPIPHIPR