Target
Neuromedin-K receptor
Ligand
BDBM50081195
Substrate
Meas. Tech.
Binding Competition Assay
pH
7.4±n/a
Ki
16±n/a nM
Comments
extracted
Citation
 Hoveyda, HRDutheuil, GFraser, GLRoy, MEl Bousmaqui, MBatt, F Chiral N-acyl-5,6,7(8-substituted)-tetrahydro-[1,2,4]triazolo[4,3-a]pyrazines as selective NK-3 receptor antagonists, pharmaceutical composition, methods for use in NK-3 receptor mediated disorders and chiral synthesis thereof US Patent  US9475814 Publication Date 10/25/2016 
Target
Name:
Neuromedin-K receptor
Synonyms:
NK-3 receptor NK3R NKR Neurokinin B receptor Neuromedin-3 receptor (NK-3R) Neuromedin-K receptor Neuromedin-K receptor (NK3) TAC3R Tachykinin receptor 3 | Tachykinin receptor 3 (NK3)
Type:
Enzyme
Mol. Mass.:
52221.96
Organism:
Homo sapiens (Human)
Description:
P29371
Residue:
465
  
Inhibitor
Name:
BDBM50081195
Synonyms:
CHEMBL3422010 US10683295, Compound 1 US9475814, 1
Type:
Small organic molecule
Emp. Form.:
C21H19N5OS2
Mol. Mass.:
421.538
SMILES:
C[C@H]1N(CCn2c1nnc2-c1csc(C)n1)C(=O)c1ccc(cc1)-c1cccs1
: