Target
Glutathione S-transferase P/Tyrosine-protein kinase JAK2
Ligand
BDBM257492
Substrate
Meas. Tech.
Biochemical HTRF Assay
Temperature
298.15±n/a K
IC50
16±n/a nM
Comments
extracted
Citation
 Brubaker, JClose, JTJung, JMartinez, MWhite, CWilson, KYoung, JRZhang, H Acyclic cyanoethylpyrazoles as janus kinase inhibitors US Patent  US9493441 Publication Date 11/15/2016 
Target
Name:
Glutathione S-transferase P/Tyrosine-protein kinase JAK2
Synonyms:
GST-JAK2
Type:
Protein
Mol. Mass.:
Description:
Components:
This complex has 2 components.
Component 1
Name:
Glutathione S-transferase P
Synonyms:
FAEES3 GST3 GSTP1-1 Glutathione S-transferase Glutathione S-transferase P Glutathione transferase (GST)
Type:
Enzyme
Mol. Mass.:
23353.53
Organism:
Homo sapiens (Human)
Description:
P09211
Residue:
210
  
Component 2
Name:
Tyrosine-protein kinase JAK2
Synonyms:
JAK-2 JAK2_HUMAN Janus kinase 2 (JAK2) | Janus kinase 2 (a protein tyrosine kinase)
Type:
Protein
Mol. Mass.:
130684.68
Organism:
Homo sapiens (Human)
Description:
O60674
Residue:
1132
  
Inhibitor
Name:
BDBM257492
Synonyms:
US9493441, 17-4
Type:
Small organic molecule
Emp. Form.:
C15H15FN6O
Mol. Mass.:
314.3176
SMILES:
NC(=O)c1cn(nc1Nc1ccnc(F)c1)[C@H](CC#N)C1CC1
: