Target
Sphingosine 1-phosphate receptor 1
Ligand
BDBM65262
Substrate
Meas. Tech.
hS1P1ERK Phosphorylation Assay
Temperature
310.15±n/a K
EC50
<10±n/a nM
Comments
extracted
Citation
 Dyckman, AJDhar, TGXiao, HGilmore, JLYang, MGXiao, ZMarcoux, D Substituted bicyclic compounds US Patent  US9522888 Publication Date 12/20/2016 
Target
Name:
Sphingosine 1-phosphate receptor 1
Synonyms:
CHEDG1 Endothelial differentiation G-protein coupled receptor 1 S1P1 S1PR1_HUMAN Sphingosine 1-phosphate receptor Edg-1
Type:
Enzyme
Mol. Mass.:
42836.02
Organism:
Homo sapiens (Human)
Description:
P21453
Residue:
382
  
Inhibitor
Name:
BDBM65262
Synonyms:
US9522888, 587
Type:
Emp. Form.:
C22H31N2O6PS
Mol. Mass.:
482.53
SMILES:
N[C@@]1(COP(O)(O)=O)CC[C@H](C1)c1ccc2C[C@H](CCc2c1)OCCOCc1nccs1
: