Target
Sphingosine 1-phosphate receptor 3
Ligand
BDBM65262
Substrate
Meas. Tech.
[35S] GTPgammaS Binding Assays
Temperature
333.15±n/a K
EC50
>625±n/a nM
Comments
extracted
Citation
 Dyckman, AJDhar, TGXiao, HGilmore, JLYang, MGXiao, ZMarcoux, D Substituted bicyclic compounds US Patent  US9522888 Publication Date 12/20/2016 
Target
Name:
Sphingosine 1-phosphate receptor 3
Synonyms:
C9orf108 EDG3 S1P receptor 3 S1P3 S1PR3_HUMAN Sphingosine 1-phosphate receptor 3 (S1P3) | Sphingosine 1-phosphate receptor Edg-3
Type:
G Protein-Coupled Receptor (GPCR)
Mol. Mass.:
42278.13
Organism:
Homo sapiens (Human)
Description:
Q99500
Residue:
378
  
Inhibitor
Name:
BDBM65262
Synonyms:
US9522888, 587
Type:
Emp. Form.:
C22H31N2O6PS
Mol. Mass.:
482.53
SMILES:
N[C@@]1(COP(O)(O)=O)CC[C@H](C1)c1ccc2C[C@H](CCc2c1)OCCOCc1nccs1
: