Target
Poly [ADP-ribose] polymerase tankyrase-1 [1091-1325]
Ligand
BDBM259593
Substrate
Meas. Tech.
Biochemical Assay
IC50
0.145±n/a nM
Citation
 Bregman, HBuchanan, JLChakka, NDimauro, EFGunaydin, HGuzman-Perez, AHua, ZHuang, X Quinazolinone compounds and derivatives thereof US Patent  US9505749 Publication Date 11/29/2016 
Target
Name:
Poly [ADP-ribose] polymerase tankyrase-1 [1091-1325]
Synonyms:
PARP5A TIN1 TNKS TNKS1_HUMAN | Tankyrase-1
Type:
Enzyme
Mol. Mass.:
26714.90
Organism:
Homo sapiens (Human)
Description:
O95271[1091-1325]
Residue:
235
  
Inhibitor
Name:
BDBM259593
Synonyms:
US9505749, 105
Type:
Small organic molecule
Emp. Form.:
C23H24ClN3O3S
Mol. Mass.:
457.973
SMILES:
Clc1ccc(O[C@H]2CC[C@@H](CC2)NC(=O)CCSc2nc3ccccc3c(=O)[nH]2)cc1
: