Target
Cyclin-dependent kinase 2/G1/S-specific cyclin-E1
Ligand
BDBM253921
Substrate
Meas. Tech.
Caliper Assay
IC50
2280±n/a nM
Citation
 Strum, JCBisi, JERoberts, PJTavares, FX HSPC-sparing treatments for RB-positive abnormal cellular proliferation US Patent  US9527857 Publication Date 12/27/2016 
Target
Name:
Cyclin-dependent kinase 2/G1/S-specific cyclin-E1
Synonyms:
CDK2/CycE CDK2/E Cyclin-Dependent Kinase 2 (CDK2) Cyclin-dependent kinase 2/cyclin E1
Type:
Protein
Mol. Mass.:
Description:
Components:
This complex has 2 components.
Component 1
Name:
Cyclin-dependent kinase 2
Synonyms:
CDK2 CDK2_HUMAN Cell division protein kinase 2 Protein cereblon/Cyclin-dependent kinase 2 | p33 protein kinase
Type:
Enzyme Subunit
Mol. Mass.:
33938.17
Organism:
Homo sapiens (Human)
Description:
P24941
Residue:
298
  
Component 2
Name:
G1/S-specific cyclin-E1
Synonyms:
CCNE CCNE1_HUMAN
Type:
Enzyme Subunit
Mol. Mass.:
47073.17
Organism:
Homo sapiens (Human)
Description:
Residue:
410
  
Inhibitor
Name:
BDBM253921
Synonyms:
US9464092, M | US9527857, M
Type:
Small organic molecule
Emp. Form.:
C30H42N8O
Mol. Mass.:
530.7075
SMILES:
C[C@H]1CN(CCN1CCC(C)(C)C)c1ccc(Nc2ncc3cc4C(=O)NCC5(CCCCC5)n4c3n2)nc1
: