Target
Cyclin-A1/Cyclin-dependent kinase 2
Ligand
BDBM253941
Substrate
Meas. Tech.
Caliper Assay
IC50
1510±n/a nM
Citation
 Strum, JCBisi, JERoberts, PJTavares, FX HSPC-sparing treatments for RB-positive abnormal cellular proliferation US Patent  US9527857 Publication Date 12/27/2016 
Target
Name:
Cyclin-A1/Cyclin-dependent kinase 2
Synonyms:
CDK2/CycA | CDK2/Cyclin A1
Type:
Mol. Mass.:
Description:
ASSAY_ID of ChEMBL is 1979627
Components:
This complex has 2 components.
Component 1
Name:
Cyclin-dependent kinase 2
Synonyms:
CDK2 CDK2_HUMAN Cell division protein kinase 2 Protein cereblon/Cyclin-dependent kinase 2 | p33 protein kinase
Type:
Enzyme Subunit
Mol. Mass.:
33938.17
Organism:
Homo sapiens (Human)
Description:
P24941
Residue:
298
  
Component 2
Name:
Cyclin-A1
Synonyms:
CCNA1 CDK2/Cyclin A1 Cyclin-A1/Cyclin-dependent kinase 4
Type:
Enzyme
Mol. Mass.:
52343.37
Organism:
Homo sapiens (Human)
Description:
P78396
Residue:
465
  
Inhibitor
Name:
BDBM253941
Synonyms:
US9464092, GG | US9527857, GG
Type:
Small organic molecule
Emp. Form.:
C26H34N8O
Mol. Mass.:
474.6012
SMILES:
CC(C)N1CCN(CC1)c1ccc(Nc2ncc3cc4C(=O)NCC5(CCCCC5)n4c3n2)nc1
: