Target
Bifunctional epoxide hydrolase 2
Ligand
BDBM408997
Substrate
Meas. Tech.
FRET-displacement assay
Ki
1.74±0.11 nM
Citation
 Hammock, BDLee, KSInceoglu, AB Potent soluble epdxide hydrolase inhibitors US Patent  US10377744 Publication Date 8/13/2019 
Target
Name:
Bifunctional epoxide hydrolase 2
Synonyms:
Cytosolic epoxide hydrolase 2 EPHX2 HYES_HUMAN Soluble epoxide hydrolase (sEH) | epoxide hydrolase 2, cytoplasmic
Type:
Enzyme
Mol. Mass.:
62613.07
Organism:
Homo sapiens (Human)
Description:
P34913
Residue:
555
  
Inhibitor
Name:
BDBM408997
Synonyms:
US10377744, Compound No. 18 US11723929, Compound 18
Type:
Small organic molecule
Emp. Form.:
C18H22F3N3O3
Mol. Mass.:
385.3808
SMILES:
FC(F)(F)c1ccc(NC(=O)NC2CCN(CC2)C(=O)C2CCOC2)cc1
: