Target
Bifunctional epoxide hydrolase 2
Ligand
BDBM409013
Substrate
Meas. Tech.
FRET-displacement assay
Ki
2.09±0.24 nM
Citation
 Hammock, BDLee, KSInceoglu, AB Potent soluble epdxide hydrolase inhibitors US Patent  US10377744 Publication Date 8/13/2019 
Target
Name:
Bifunctional epoxide hydrolase 2
Synonyms:
Cytosolic epoxide hydrolase 2 EPHX2 HYES_HUMAN Soluble epoxide hydrolase (sEH) | epoxide hydrolase 2, cytoplasmic
Type:
Enzyme
Mol. Mass.:
62613.07
Organism:
Homo sapiens (Human)
Description:
P34913
Residue:
555
  
Inhibitor
Name:
BDBM409013
Synonyms:
US10377744, Compound No. 33 US11723929, Compound 33
Type:
Small organic molecule
Emp. Form.:
C18H21F4N3O3
Mol. Mass.:
403.3713
SMILES:
Fc1cc(NC(=O)NC2CCN(CC2)C(=O)C2CCOC2)ccc1C(F)(F)F
: