Target
Bifunctional epoxide hydrolase 2
Ligand
BDBM409025
Substrate
Meas. Tech.
FRET-displacement assay
Ki
3.40±1.38 nM
Citation
 Hammock, BDLee, KSInceoglu, AB Potent soluble epdxide hydrolase inhibitors US Patent  US10377744 Publication Date 8/13/2019 
Target
Name:
Bifunctional epoxide hydrolase 2
Synonyms:
Cytosolic epoxide hydrolase 2 EPHX2 HYES_HUMAN Soluble epoxide hydrolase (sEH) | epoxide hydrolase 2, cytoplasmic
Type:
Enzyme
Mol. Mass.:
62613.07
Organism:
Homo sapiens (Human)
Description:
P34913
Residue:
555
  
Inhibitor
Name:
BDBM409025
Synonyms:
US10377744, Compound No. 45 US11723929, Compound 45
Type:
Small organic molecule
Emp. Form.:
C18H23BrF3N3O3
Mol. Mass.:
466.293
SMILES:
CC[C@H](C)C(=O)N1CCC(CC1)NC(=O)Nc1ccc(OC(F)(F)F)c(Br)c1
: