Target
Epoxide hydrolase
Ligand
BDBM100423
Substrate
Meas. Tech.
Inhibition Assay
IC50
67.0±n/a nM
Citation
 Guedes, AGHammock, BDMorisseau, C Treatment of inflammatory disorders in non-human mammals US Patent  US10383835 Publication Date 8/20/2019 
Target
Name:
Epoxide hydrolase
Synonyms:
EPHX1
Type:
Enzyme
Mol. Mass.:
52112.47
Organism:
Ovis aries (Sheep)
Description:
W5Q7Q6
Residue:
451
  
Inhibitor
Name:
BDBM100423
Synonyms:
US10383835, Compound 1153 US8501783, 1153
Type:
Small organic molecule
Emp. Form.:
C18H29N3O2
Mol. Mass.:
319.4418
SMILES:
CC(=O)N1CCC(CC1)NC(=O)NC12CC3CC(CC(C3)C1)C2
: