Target
Bifunctional epoxide hydrolase 2
Ligand
BDBM25741
Substrate
Meas. Tech.
Inhibition Assay
IC50
12.0±n/a nM
Citation
 Guedes, AGHammock, BDMorisseau, C Treatment of inflammatory disorders in non-human mammals US Patent  US10383835 Publication Date 8/20/2019 
Target
Name:
Bifunctional epoxide hydrolase 2
Synonyms:
EPHX2 Soluble Epoxide Hydrolase
Type:
Mol. Mass.:
62766.18
Organism:
Sus scrofa (Pig)
Description:
Q6Q2C2
Residue:
555
  
Inhibitor
Name:
BDBM25741
Synonyms:
4-{[4-({[4-(trifluoromethoxy)phenyl]carbamoyl}amino)cyclohexyl]oxy}benzoic acid Urea-based compound, 22
Type:
Small organic molecule
Emp. Form.:
C21H21F3N2O5
Mol. Mass.:
438.397
SMILES:
OC(=O)c1ccc(OC2CCC(CC2)NC(=O)Nc2ccc(OC(F)(F)F)cc2)cc1
: