Target
Epoxide hydrolase
Ligand
BDBM410785
Substrate
Meas. Tech.
Inhibition Assay
IC50
1.000±n/a nM
Citation
 Guedes, AGHammock, BDMorisseau, C Treatment of inflammatory disorders in non-human mammals US Patent  US10383835 Publication Date 8/20/2019 
Target
Name:
Epoxide hydrolase
Synonyms:
EPHX1
Type:
Enzyme
Mol. Mass.:
52112.47
Organism:
Ovis aries (Sheep)
Description:
W5Q7Q6
Residue:
451
  
Inhibitor
Name:
BDBM410785
Synonyms:
US10383835, Compound 2225 | trans-N-methyl- 4-[4- (3-Adamantan-1- yl-ureido)- cyclohexyloxy]- benzamide
Type:
Small organic molecule
Emp. Form.:
C25H35N3O3
Mol. Mass.:
425.5637
SMILES:
CNC(=O)c1ccc(O[C@H]2CCC(CC2)NC(=O)NC23CC4CC(CC(C4)C2)C3)cc1
: