Target
Epoxide hydrolase
Ligand
BDBM158485
Substrate
Meas. Tech.
Inhibition Assay
IC50
1.000±n/a nM
Citation
 Guedes, AGHammock, BDMorisseau, C Treatment of inflammatory disorders in non-human mammals US Patent  US10383835 Publication Date 8/20/2019 
Target
Name:
Epoxide hydrolase
Synonyms:
EPHX1
Type:
Enzyme
Mol. Mass.:
48577.06
Organism:
Equus caballus (Horse)
Description:
A0A5F5PR84
Residue:
462
  
Inhibitor
Name:
BDBM158485
Synonyms:
US10383835, Compound 2228 | US9029401, 2227
Type:
Small organic molecule
Emp. Form.:
C22H24F3N3O4
Mol. Mass.:
451.4389
SMILES:
CNC(=O)c1ccc(O[C@H]2CCC(CC2)NC(=O)Nc2ccc(OC(F)(F)F)cc2)cc1
: