Target
Toll-like receptor 7
Ligand
BDBM420564
Substrate
Meas. Tech.
Biological Assay
IC50
0.200±n/a nM
Citation
 Dyckman, AJDodd, DSMussari, CPPasunoori, LKumar, SR [1,2,4]triazolo[1,5-a]pyridinyl substituted indole compounds US Patent  US10478424 Publication Date 11/19/2019 
Target
Name:
Toll-like receptor 7
Synonyms:
ORF Names:UNQ248/PRO285 TLR7_HUMAN | Toll-like receptor 7 (TLR7)
Type:
Enzyme
Mol. Mass.:
120945.35
Organism:
Homo sapiens (Human)
Description:
Q9NYK1
Residue:
1049
  
Inhibitor
Name:
BDBM420564
Synonyms:
US10478424, Example 253
Type:
Small organic molecule
Emp. Form.:
C25H25F3N6
Mol. Mass.:
466.5014
SMILES:
CC(C)c1c([nH]c2ccc(cc12)C1CCN(CC#N)CC1)-c1cc(c2ncnn2c1)C(F)(F)F
: