Target
Non-receptor tyrosine-protein kinase TYK2
Ligand
BDBM425494
Substrate
Meas. Tech.
Biochemical JAK Kinase Assays
Ki
0.250±n/a nM
Citation
 Fatheree, PRBrandt, GESmith, CSullivan, SDVan Orden, LJKleinschek, MACrater, GD Fused imidazo-piperidine JAK inhibitors US Patent  US10519153 Publication Date 12/31/2019 
Target
Name:
Non-receptor tyrosine-protein kinase TYK2
Synonyms:
Non-receptor tyrosine-protein kinase TYK2 (TYK2) TYK2_HUMAN | Tyrosine-protein kinase TYK2
Type:
Protein
Mol. Mass.:
133666.03
Organism:
Homo sapiens (Human)
Description:
P29597
Residue:
1187
  
Inhibitor
Name:
BDBM425494
Synonyms:
US10519153, Example 1-12
Type:
Emp. Form.:
C30H36FN7O2
Mol. Mass.:
545.6509
SMILES:
CCc1cc(O)c(F)cc1-c1ccc2c(n[nH]c2c1)-c1nc2CC(N(C)Cc2[nH]1)C(=O)N1CCN(CC1)C(C)C
: