Target
Non-receptor tyrosine-protein kinase TYK2
Ligand
BDBM425851
Substrate
Meas. Tech.
Biochemical JAK Kinase Assays
Ki
1.26±n/a nM
Citation
 Fatheree, PRBrandt, GESmith, CSullivan, SDVan Orden, LJKleinschek, MACrater, GD Fused imidazo-piperidine JAK inhibitors US Patent  US10519153 Publication Date 12/31/2019 
Target
Name:
Non-receptor tyrosine-protein kinase TYK2
Synonyms:
Non-receptor tyrosine-protein kinase TYK2 (TYK2) TYK2_HUMAN | Tyrosine-protein kinase TYK2
Type:
Protein
Mol. Mass.:
133666.03
Organism:
Homo sapiens (Human)
Description:
P29597
Residue:
1187
  
Inhibitor
Name:
BDBM425851
Synonyms:
US10519153, Example 1-37
Type:
Emp. Form.:
C32H40FN7O2
Mol. Mass.:
573.7041
SMILES:
CCN1Cc2[nH]c(nc2C[C@H]1C(=O)N1CCN(CC1)C(C)(C)C)-c1n[nH]c2cc(ccc12)-c1cc(F)c(O)cc1CC
: