Target
5-hydroxytryptamine receptor 7
Ligand
BDBM426859
Substrate
Meas. Tech.
FLIPR Calcium Assay
EC50
500±n/a nM
Citation
 Ueng, SYeh, SLin, SShih, CLoh, H Thiazolidinone compounds and use thereof US Patent  US10544113 Publication Date 1/28/2020 
Target
Name:
5-hydroxytryptamine receptor 7
Synonyms:
5-HT-7 5-HT7 5-HT7S 5HT7 HTR7 | Serotonin receptor 7
Type:
G Protein-Coupled Receptor (GPCR)
Mol. Mass.:
53573.08
Organism:
Homo sapiens (Human)
Description:
P34969
Residue:
479
  
Inhibitor
Name:
BDBM426859
Synonyms:
N-(Butylsulfonyl)-4-[2-(4-fluorophenyl)-4-oxo-1,3-thiazolidin-3-yl]-3-methylbenzamide | US10544113, No. 123
Type:
Small organic molecule
Emp. Form.:
C16H12ClF2NOS
Mol. Mass.:
339.787
SMILES:
Cc1ccc(F)cc1N1C(SCC1=O)c1ccc(Cl)c(F)c1
: