Target
5-hydroxytryptamine receptor 7
Ligand
BDBM426893
Substrate
Meas. Tech.
FLIPR Calcium Assay
EC50
200±n/a nM
Citation
 Ueng, SYeh, SLin, SShih, CLoh, H Thiazolidinone compounds and use thereof US Patent  US10544113 Publication Date 1/28/2020 
Target
Name:
5-hydroxytryptamine receptor 7
Synonyms:
5-HT-7 5-HT7 5-HT7S 5HT7 HTR7 | Serotonin receptor 7
Type:
G Protein-Coupled Receptor (GPCR)
Mol. Mass.:
53573.08
Organism:
Homo sapiens (Human)
Description:
P34969
Residue:
479
  
Inhibitor
Name:
BDBM426893
Synonyms:
2-Oxopropyl 4-[2-(4-fluorophenyl)-4-oxo-1,3-thiazolidin-3-yl]-3-methylbenzoate | US10544113, No. 200
Type:
Small organic molecule
Emp. Form.:
C23H18BrFN2O4S2
Mol. Mass.:
549.432
SMILES:
Cc1cc(ccc1N1C(SCC1=O)c1ccc(F)cc1)C(=O)NS(=O)(=O)c1ccc(Br)cc1
: