Target
5-hydroxytryptamine receptor 7
Ligand
BDBM426898
Substrate
Meas. Tech.
FLIPR Calcium Assay
EC50
700±n/a nM
Citation
 Ueng, SYeh, SLin, SShih, CLoh, H Thiazolidinone compounds and use thereof US Patent  US10544113 Publication Date 1/28/2020 
Target
Name:
5-hydroxytryptamine receptor 7
Synonyms:
5-HT-7 5-HT7 5-HT7S 5HT7 HTR7 | Serotonin receptor 7
Type:
G Protein-Coupled Receptor (GPCR)
Mol. Mass.:
53573.08
Organism:
Homo sapiens (Human)
Description:
P34969
Residue:
479
  
Inhibitor
Name:
BDBM426898
Synonyms:
1,3-Dimethoxy-2-propanyl 4-[2-(4-fluorophenyl)-4-oxo-1,3-thiazolidin-3-yl]-3-methylbenzoate | US10544113, No. 210
Type:
Small organic molecule
Emp. Form.:
C29H26FN3O4S2
Mol. Mass.:
563.663
SMILES:
CN(C)c1cccc2c(cccc12)S(=O)(=O)NC(=O)c1ccc(N2C(SCC2=O)c2ccc(F)cc2)c(C)c1
: