Target
5-hydroxytryptamine receptor 7
Ligand
BDBM427033
Substrate
Meas. Tech.
Radiolabel Binding Studies for Serotonin 5HT7 receptors
IC50
12.0±n/a nM
Citation
 Canney, DJBlass, BEGao, RAbou-Gharbia, M 5-hydroxytryptamine receptor 7 activity modulators and their method of use US Patent  US10544117 Publication Date 1/28/2020 
Target
Name:
5-hydroxytryptamine receptor 7
Synonyms:
5-HT-7 5-HT7 5-HT7S 5HT7 HTR7 | Serotonin receptor 7
Type:
G Protein-Coupled Receptor (GPCR)
Mol. Mass.:
53573.08
Organism:
Homo sapiens (Human)
Description:
P34969
Residue:
479
  
Inhibitor
Name:
BDBM427033
Synonyms:
US10544117, Entry 230062 | US11192871, Example 230062
Type:
Small organic molecule
Emp. Form.:
C24H38N2O2
Mol. Mass.:
386.5707
SMILES:
CCC1(CC)CC(CCCN2CCN(CC2)c2ccccc2C(C)C)OC1=O
: