Target
Bombesin receptor subtype-3
Ligand
BDBM428850
Substrate
Meas. Tech.
BB2 Receptor Antagonistic Activity
IC50
18.3±n/a nM
Citation
 Hisamichi, HShimada, IIshihara, TTakuwa, TShimizu, TIshikawa, NMaeno, KSeki, N Tetrahydroisoquinolin-1-one derivative or salt thereof US Patent  US10532048 Publication Date 1/14/2020 
Target
Name:
Bombesin receptor subtype-3
Synonyms:
BRS-3 BRS3_HUMAN Bombesin like receptor 3
Type:
Enzyme Catalytic Domain
Mol. Mass.:
44424.45
Organism:
Homo sapiens (Human)
Description:
Bombesin 3 BRS3 HUMAN::P32247
Residue:
399
  
Inhibitor
Name:
BDBM428850
Synonyms:
US10532048, Example 62
Type:
Small organic molecule
Emp. Form.:
C32H28Cl2N2O3
Mol. Mass.:
559.482
SMILES:
OC[C@@H](N1[C@H]([C@H](C(=O)NCCc2ccccc2)c2ccccc2C1=O)c1ccc(Cl)cc1Cl)c1ccccc1
: