Target
Proteinase-activated receptor 2
Ligand
BDBM429568
Substrate
Meas. Tech.
IP-One HTRF Assay
IC50
330±n/a nM
Citation
 Cumming, JGWu, FXEdman, KHChen, HBrown, DGBurli, RWJohnstone, SDBrown, GATehan, BGTeobald, BJCongreve, MS Inhibitors of protease-activated receptor-2 US Patent  US10550089 Publication Date 2/4/2020 
Target
Name:
Proteinase-activated receptor 2
Synonyms:
F2RL1 PAR2 | PAR2_HUMAN
Type:
PROTEIN
Mol. Mass.:
44152.54
Organism:
Homo sapiens (Human)
Description:
ChEMBL_1497756
Residue:
397
  
Inhibitor
Name:
BDBM429568
Synonyms:
US10550089, Example 42 | US10995072, Example 42
Type:
Small organic molecule
Emp. Form.:
C14H13FN2O2
Mol. Mass.:
260.2636
SMILES:
CCc1coc2c(F)ccc([C@H](O)c3ncc[nH]3)c12
: