Target
Proteinase-activated receptor 2
Ligand
BDBM429569
Substrate
Meas. Tech.
IP-One HTRF Assay
IC50
860±n/a nM
Citation
 Cumming, JGWu, FXEdman, KHChen, HBrown, DGBurli, RWJohnstone, SDBrown, GATehan, BGTeobald, BJCongreve, MS Inhibitors of protease-activated receptor-2 US Patent  US10550089 Publication Date 2/4/2020 
Target
Name:
Proteinase-activated receptor 2
Synonyms:
F2RL1 PAR2 | PAR2_HUMAN
Type:
PROTEIN
Mol. Mass.:
44152.54
Organism:
Homo sapiens (Human)
Description:
ChEMBL_1497756
Residue:
397
  
Inhibitor
Name:
BDBM429569
Synonyms:
US10550089, Example 43 US10550089, Example 45 | US10995072, Example 43
Type:
Small organic molecule
Emp. Form.:
C15H13FN2O2
Mol. Mass.:
272.2743
SMILES:
OC(c1ncc[nH]1)c1ccc(F)c2occ(C3CC3)c12
: