Target
5-hydroxytryptamine receptor 1A
Ligand
BDBM433478
Substrate
Meas. Tech.
Receptor Binding Assay
Ki
0.043±n/a nM
Citation
 Sniecikowska, JBucki, ANewman-Tancredi, AVarney, MA Compounds for treating disorders sensitive to serotoninergic regulation controlled by the 5-HT1A receptors US Patent  US10562853 Publication Date 2/18/2020 
Target
Name:
5-hydroxytryptamine receptor 1A
Synonyms:
5-HT-1A 5-hydroxytryptamine receptor 1A (5-HT-1A) ADRB2RL1 Dopamine D2 receptor and serotonin 1a receptor HTR1A | Serotonin receptor 1A
Type:
Mol. Mass.:
46122.49
Organism:
Homo sapiens (Human)
Description:
Residue:
422
  
Inhibitor
Name:
BDBM433478
Synonyms:
US10562853, Compound 4
Type:
Small organic molecule
Emp. Form.:
C21H22Cl2F2N2O2
Mol. Mass.:
443.314
SMILES:
Fc1ccc(cc1Cl)C(=O)N1CCC(F)(CNCCOc2cccc(Cl)c2)CC1
: