Target
Serine/threonine-protein kinase B-raf
Ligand
BDBM50396483
Substrate
Meas. Tech.
Enzymatic Activity Assay
IC50
100.0±n/a nM
Citation
 Mahmoud, GEChoi, HSYoo, KHHan, DKOh, CHMohammed, AMohammed, IE Imidazooxazole derivative having antitumor effect, and pharmaceutical composition including same US Patent  US10570155 Publication Date 2/25/2020 
Target
Name:
Serine/threonine-protein kinase B-raf
Synonyms:
B-RAF B-Raf proto-oncogene serine/threonine-protein kinase BRAF1 RAFB1 v-Raf murine sarcoma viral oncogene homolog B1
Type:
Serine/threonine-protein kinase
Mol. Mass.:
84446.00
Organism:
Homo sapiens (Human)
Description:
P15056
Residue:
766
  
Inhibitor
Name:
BDBM50396483
Synonyms:
PLX-4032 Ro 5185426 US11332479, Compound Vemurafenib US9388165, Reference, Vemurafenib (PLX-4032) VEMURAFENIB
Type:
Small organic molecule
Emp. Form.:
C23H18ClF2N3O3S
Mol. Mass.:
489.922
SMILES:
CCCS(=O)(=O)Nc1ccc(F)c(C(=O)c2c[nH]c3ncc(cc23)-c2ccc(Cl)cc2)c1F
: