Target
Fibroblast growth factor receptor 1
Ligand
BDBM249396
Substrate
Meas. Tech.
Inhibition Assay
IC50
210±n/a nM
Citation
 Chen, LGuan, DBai, HGou, JZhao, WWang, ZLing, LMa, Y Pyrimidine derivative, method for preparing same and use thereof in medicine US Patent  US10654836 Publication Date 5/19/2020 
Target
Name:
Fibroblast growth factor receptor 1
Synonyms:
BFGFR Basic fibroblast growth factor receptor 1 (FGFR1) CEK FGFR-1 FGFR-1, (FL) FGFR1_HUMAN FLT2 Fibroblast growth factor receptor 1 (FGFR-1) Fms-like tyrosine kinase 2 N-sam bFGF-R | c-fgr
Type:
Receptor
Mol. Mass.:
91861.70
Organism:
Homo sapiens (Human)
Description:
P11362
Residue:
822
  
Inhibitor
Name:
BDBM249396
Synonyms:
US10537571, Compound 108 US10654836, The compound of example 108 of WO2015057938 US11001572, Example 108 of WO2015057938 US9730931, Compound 108
Type:
Small organic molecule
Emp. Form.:
C29H34Cl2N8O4
Mol. Mass.:
629.537
SMILES:
CCN1CCN(CC1)c1ccc(Nc2cc(ncn2)N(C)C(=O)Nc2c(Cl)c(OC)cc(OC)c2Cl)c(NC(=O)C=C)c1
: