Target
Vascular endothelial growth factor receptor 2
Ligand
BDBM445257
Substrate
Meas. Tech.
EGFR2 Enzyme Inhibition
Ki
3.68±n/a nM
Citation
 Walters, IBirch, LCollingwood, SPStevenson, CS Indole derivatives and their use as protein kinase inhibitors US Patent  US10669235 Publication Date 6/2/2020 
Target
Name:
Vascular endothelial growth factor receptor 2
Synonyms:
CD_antigen=CD309 Fetal liver kinase 1 (FLK-1) KDR Protein-tyrosine kinase receptor Flk-1 VEGFR-2 VEGFR2 Vascular Endothelial Growth Factor Receptor Kinase 2 Vascular endothelial growth factor receptor 2 (KDR) Vascular endothelial growth factor receptor 2 (VEGFR2) Vascular endothelial growth factor receptor-2 (VEGFR-2)
Type:
Receptor Tyrosine Kinase
Mol. Mass.:
151510.97
Organism:
Homo sapiens (Human)
Description:
P35968
Residue:
1356
  
Inhibitor
Name:
BDBM445257
Synonyms:
US10669235, Example 48 | US11208381, Example 48
Type:
Small organic molecule
Emp. Form.:
C31H32N4O5
Mol. Mass.:
540.6096
SMILES:
COC(=O)c1cc2NC(=O)\C(=C(/Nc3ccc(cc3)C(=O)N(C)[C@H]3CN(C)C[C@@H]3O)c3ccccc3)c2cc1C
: