Target
Prostaglandin E synthase
Ligand
BDBM451413
Substrate
Meas. Tech.
Inhibitory Activity Assay
IC50
0.480±n/a nM
Citation
 Okada, MNakano, YNose, TNishimoto, TMaeda, S Pyrimidine derivative US Patent  US10710967 Publication Date 7/14/2020 
Target
Name:
Prostaglandin E synthase
Synonyms:
MGST1L1 PGES PTGES Prostaglandin E synthase (PGES-1) Prostaglandin E synthase-1 (PGES-1) Prostaglandin E2 synthase-1 ( mPGES-1)
Type:
Protein
Mol. Mass.:
17112.22
Organism:
Homo sapiens (Human)
Description:
Residue:
152
  
Inhibitor
Name:
BDBM451413
Synonyms:
US10710967, Example 7
Type:
Small organic molecule
Emp. Form.:
C20H18Cl2N4O2
Mol. Mass.:
417.289
SMILES:
CC(C)C(=O)NCc1ccc(Cl)c(c1)-c1nc(cc(=O)[nH]1)-c1ccc(Cl)cn1
: