Target
Toll-like receptor 8
Ligand
BDBM427618
Substrate
Meas. Tech.
TLR7/8/9 Inhibition Reporter Assays
IC50
0.230±n/a nM
Citation
 Dyckman, AJDodd, DSMussari, CPSherwood, TCWhiteley, BKGilmore, JLKumar, SRPasunoori, LSrinivas, PVDuraisamy, SKHegde, SAnumula, RK 4-Azaindole compounds US Patent  US10730877 Publication Date 8/4/2020 
Target
Name:
Toll-like receptor 8
Synonyms:
CD_antigen: CD288 TLR8_HUMAN | TRL8
Type:
Enzyme
Mol. Mass.:
119828.77
Organism:
Homo sapiens (Human)
Description:
Q9NR97
Residue:
1041
  
Inhibitor
Name:
BDBM427618
Synonyms:
US10544143, Example 53 US11053244, Example 53
Type:
Small organic molecule
Emp. Form.:
C26H34N6O2S
Mol. Mass.:
494.652
SMILES:
CC(C)c1c([nH]c2ccc(nc12)N1CCC(CC1)NCCS(C)(=O)=O)-c1cn(C)c2ncccc12
: