Target
Toll-like receptor 7
Ligand
BDBM427907
Substrate
Meas. Tech.
TLR7/8/9 Inhibition Reporter Assays
IC50
0.120±n/a nM
Citation
 Dyckman, AJDodd, DSMussari, CPSherwood, TCWhiteley, BKGilmore, JLKumar, SRPasunoori, LSrinivas, PVDuraisamy, SKHegde, SAnumula, RK 4-Azaindole compounds US Patent  US10730877 Publication Date 8/4/2020 
Target
Name:
Toll-like receptor 7
Synonyms:
ORF Names:UNQ248/PRO285 TLR7_HUMAN | Toll-like receptor 7 (TLR7)
Type:
Enzyme
Mol. Mass.:
120945.35
Organism:
Homo sapiens (Human)
Description:
Q9NYK1
Residue:
1049
  
Inhibitor
Name:
BDBM427907
Synonyms:
US10544143, Example 341 US10730877, Example 342 | US11053244, Example 342
Type:
Small organic molecule
Emp. Form.:
C28H35FN6O2
Mol. Mass.:
506.6149
SMILES:
COc1cc(cn2ncnc12)-c1[nH]c2cc(F)c(nc2c1C(C)C)C1CCC(CC1)NCC1(C)COC1
: